{"text_format":"3","workbook":"xlsx","n_sheets":23,"sheets":["1","2","3","4","5","6","7","8","9","10","11","12","13","14","15","16","17","18","19","20","Master Yield","Draft changes for 2021","Data Validations"],"not_rendered":{"images":4,"defined_names":59},"read":"whole","date_system":"1900"}

{"sheet":"1","index":0,"n_rows":55,"n_cols":18,"rows_kept":55,"merged":[[0,12,0,14],[6,1,6,14],[7,1,7,14],[8,2,8,4],[8,6,8,7],[9,2,9,4],[9,5,9,6],[9,12,9,13],[10,2,10,4],[10,5,10,6],[11,1,11,7],[11,10,11,14],[12,1,12,7],[12,10,12,14],[13,10,13,11],[14,10,14,11],[15,10,15,11],[16,10,16,11],[17,10,17,11],[18,10,18,11],[19,10,19,11],[20,10,20,11],[21,10,21,11],[22,10,22,11],[23,10,23,11],[24,10,24,11],[25,10,25,11],[26,10,26,11],[27,10,27,11],[28,10,28,11],[29,10,29,11],[30,10,30,11],[31,10,31,11],[32,10,32,11],[33,10,33,11],[35,10,35,11],[36,1,36,3],[36,10,36,11],[37,1,37,3],[37,10,37,11],[38,1,38,3],[38,10,38,11],[39,1,39,3],[39,10,39,11],[40,1,40,3],[41,1,41,3],[41,5,41,6],[41,10,41,11],[42,1,43,6],[42,10,42,11],[43,10,43,11],[44,10,44,11],[45,1,45,7],[45,10,45,11],[46,10,46,11],[47,10,47,11],[48,10,48,11],[49,1,49,14],[50,1,50,3]]}
[{"$nulls":15},"HIDE","HIDE"]
[]
[]
[]
[]
[]
[null,"Input content in the cells that are this color.",{"$nulls":14},{"$f":"O10-66","v":"2024-09-10"}]
[null,"Sugar Beet Production Reporting Worksheet",{"$nulls":14},{"$f":"O10-46","v":"2024-09-30"}]
{"$rows_left_out":48}
{"sheet":"2","index":1,"n_rows":55,"n_cols":18,"rows_kept":55,"merged":[[0,12,0,14],[6,1,6,14],[7,1,7,14],[8,2,8,4],[8,6,8,7],[9,2,9,4],[9,5,9,6],[9,12,9,13],[10,2,10,4],[10,5,10,6],[11,1,11,7],[11,10,11,14],[12,1,12,7],[12,10,12,14],[13,10,13,11],[14,10,14,11],[15,10,15,11],[16,10,16,11],[17,10,17,11],[18,10,18,11],[19,10,19,11],[20,10,20,11],[21,10,21,11],[22,10,22,11],[23,10,23,11],[24,10,24,11],[25,10,25,11],[26,10,26,11],[27,10,27,11],[28,10,28,11],[29,10,29,11],[30,10,30,11],[31,10,31,11],[32,10,32,11],[33,10,33,11],[35,10,35,11],[36,1,36,3],[36,10,36,11],[37,1,37,3],[37,10,37,11],[38,1,38,3],[38,10,38,11],[39,1,39,3],[39,10,39,11],[40,1,40,3],[41,1,41,3],[41,5,41,6],[41,10,41,11],[42,1,43,6],[42,10,42,11],[43,10,43,11],[44,10,44,11],[45,1,45,7],[45,10,45,11],[46,10,46,11],[47,10,47,11],[48,10,48,11],[49,1,49,14],[50,1,50,3]]}
[{"$nulls":15},"HIDE","HIDE"]
[]
[]
[]
[]
[]
[null,"Input content in the cells that are this color.",{"$nulls":14},{"$f":"O10-66","v":"2024-09-10"}]
[null,"Sugar Beet Production Reporting Worksheet",{"$nulls":14},{"$f":"O10-46","v":"2024-09-30"}]
{"$rows_left_out":48}
{"sheet":"3","index":2,"n_rows":55,"n_cols":18,"rows_kept":55,"merged":[[0,12,0,14],[6,1,6,14],[7,1,7,14],[8,2,8,4],[8,6,8,7],[9,2,9,4],[9,5,9,6],[9,12,9,13],[10,2,10,4],[10,5,10,6],[11,1,11,7],[11,10,11,14],[12,1,12,7],[12,10,12,14],[13,10,13,11],[14,10,14,11],[15,10,15,11],[16,10,16,11],[17,10,17,11],[18,10,18,11],[19,10,19,11],[20,10,20,11],[21,10,21,11],[22,10,22,11],[23,10,23,11],[24,10,24,11],[25,10,25,11],[26,10,26,11],[27,10,27,11],[28,10,28,11],[29,10,29,11],[30,10,30,11],[31,10,31,11],[32,10,32,11],[33,10,33,11],[35,10,35,11],[36,1,36,3],[36,10,36,11],[37,1,37,3],[37,10,37,11],[38,1,38,3],[38,10,38,11],[39,1,39,3],[39,10,39,11],[40,1,40,3],[41,1,41,3],[41,5,41,6],[41,10,41,11],[42,1,43,6],[42,10,42,11],[43,10,43,11],[44,10,44,11],[45,1,45,7],[45,10,45,11],[46,10,46,11],[47,10,47,11],[48,10,48,11],[49,1,49,14],[50,1,50,3]]}
[{"$nulls":15},"HIDE","HIDE"]
[]
[]
[]
[]
[]
[null,"Input content in the cells that are this color.",{"$nulls":14},{"$f":"O10-66","v":"2024-09-10"}]
[null,"Sugar Beet Production Reporting Worksheet",{"$nulls":14},{"$f":"O10-46","v":"2024-09-30"}]
{"$rows_left_out":48}
{"sheet":"4","index":3,"n_rows":55,"n_cols":18,"rows_kept":55,"merged":[[0,12,0,14],[6,1,6,14],[7,1,7,14],[8,2,8,4],[8,6,8,7],[9,2,9,4],[9,5,9,6],[9,12,9,13],[10,2,10,4],[10,5,10,6],[11,1,11,7],[11,10,11,14],[12,1,12,7],[12,10,12,14],[13,10,13,11],[14,10,14,11],[15,10,15,11],[16,10,16,11],[17,10,17,11],[18,10,18,11],[19,10,19,11],[20,10,20,11],[21,10,21,11],[22,10,22,11],[23,10,23,11],[24,10,24,11],[25,10,25,11],[26,10,26,11],[27,10,27,11],[28,10,28,11],[29,10,29,11],[30,10,30,11],[31,10,31,11],[32,10,32,11],[33,10,33,11],[35,10,35,11],[36,1,36,3],[36,10,36,11],[37,1,37,3],[37,10,37,11],[38,1,38,3],[38,10,38,11],[39,1,39,3],[39,10,39,11],[40,1,40,3],[41,1,41,3],[41,5,41,6],[41,10,41,11],[42,1,43,6],[42,10,42,11],[43,10,43,11],[44,10,44,11],[45,1,45,7],[45,10,45,11],[46,10,46,11],[47,10,47,11],[48,10,48,11],[49,1,49,14],[50,1,50,3]]}
[{"$nulls":15},"HIDE","HIDE"]
[]
[]
[]
[]
[]
[null,"Input content in the cells that are this color.",{"$nulls":14},{"$f":"O10-66","v":"2024-09-10"}]
[null,"Sugar Beet Production Reporting Worksheet",{"$nulls":14},{"$f":"O10-46","v":"2024-09-30"}]
{"$rows_left_out":48}
{"sheet":"5","index":4,"n_rows":55,"n_cols":18,"rows_kept":55,"merged":[[0,12,0,14],[6,1,6,14],[7,1,7,14],[8,2,8,4],[8,6,8,7],[9,2,9,4],[9,5,9,6],[9,12,9,13],[10,2,10,4],[10,5,10,6],[11,1,11,7],[11,10,11,14],[12,1,12,7],[12,10,12,14],[13,10,13,11],[14,10,14,11],[15,10,15,11],[16,10,16,11],[17,10,17,11],[18,10,18,11],[19,10,19,11],[20,10,20,11],[21,10,21,11],[22,10,22,11],[23,10,23,11],[24,10,24,11],[25,10,25,11],[26,10,26,11],[27,10,27,11],[28,10,28,11],[29,10,29,11],[30,10,30,11],[31,10,31,11],[32,10,32,11],[33,10,33,11],[35,10,35,11],[36,1,36,3],[36,10,36,11],[37,1,37,3],[37,10,37,11],[38,1,38,3],[38,10,38,11],[39,1,39,3],[39,10,39,11],[40,1,40,3],[41,1,41,3],[41,5,41,6],[41,10,41,11],[42,1,43,6],[42,10,42,11],[43,10,43,11],[44,10,44,11],[45,1,45,7],[45,10,45,11],[46,10,46,11],[47,10,47,11],[48,10,48,11],[49,1,49,14],[50,1,50,3]]}
[{"$nulls":15},"HIDE","HIDE"]
[]
[]
[]
[]
[]
[null,"Input content in the cells that are this color.",{"$nulls":14},{"$f":"O10-66","v":"2024-09-10"}]
[null,"Sugar Beet Production Reporting Worksheet",{"$nulls":14},{"$f":"O10-46","v":"2024-09-30"}]
{"$rows_left_out":48}
{"sheet":"6","index":5,"n_rows":55,"n_cols":18,"rows_kept":55,"merged":[[0,12,0,14],[6,1,6,14],[7,1,7,14],[8,2,8,4],[8,6,8,7],[9,2,9,4],[9,5,9,6],[9,12,9,13],[10,2,10,4],[10,5,10,6],[11,1,11,7],[11,10,11,14],[12,1,12,7],[12,10,12,14],[13,10,13,11],[14,10,14,11],[15,10,15,11],[16,10,16,11],[17,10,17,11],[18,10,18,11],[19,10,19,11],[20,10,20,11],[21,10,21,11],[22,10,22,11],[23,10,23,11],[24,10,24,11],[25,10,25,11],[26,10,26,11],[27,10,27,11],[28,10,28,11],[29,10,29,11],[30,10,30,11],[31,10,31,11],[32,10,32,11],[33,10,33,11],[35,10,35,11],[36,1,36,3],[36,10,36,11],[37,1,37,3],[37,10,37,11],[38,1,38,3],[38,10,38,11],[39,1,39,3],[39,10,39,11],[40,1,40,3],[41,1,41,3],[41,5,41,6],[41,10,41,11],[42,1,43,6],[42,10,42,11],[43,10,43,11],[44,10,44,11],[45,1,45,7],[45,10,45,11],[46,10,46,11],[47,10,47,11],[48,10,48,11],[49,1,49,14],[50,1,50,3]]}
[{"$nulls":15},"HIDE","HIDE"]
[]
[]
[]
[]
[]
[null,"Input content in the cells that are this color.",{"$nulls":14},{"$f":"O10-66","v":"2024-09-10"}]
[null,"Sugar Beet Production Reporting Worksheet",{"$nulls":14},{"$f":"O10-46","v":"2024-09-30"}]
{"$rows_left_out":48}
{"sheet":"7","index":6,"n_rows":55,"n_cols":18,"rows_kept":55,"merged":[[0,12,0,14],[6,1,6,14],[7,1,7,14],[8,2,8,4],[8,6,8,7],[9,2,9,4],[9,5,9,6],[9,12,9,13],[10,2,10,4],[10,5,10,6],[11,1,11,7],[11,10,11,14],[12,1,12,7],[12,10,12,14],[13,10,13,11],[14,10,14,11],[15,10,15,11],[16,10,16,11],[17,10,17,11],[18,10,18,11],[19,10,19,11],[20,10,20,11],[21,10,21,11],[22,10,22,11],[23,10,23,11],[24,10,24,11],[25,10,25,11],[26,10,26,11],[27,10,27,11],[28,10,28,11],[29,10,29,11],[30,10,30,11],[31,10,31,11],[32,10,32,11],[33,10,33,11],[35,10,35,11],[36,1,36,3],[36,10,36,11],[37,1,37,3],[37,10,37,11],[38,1,38,3],[38,10,38,11],[39,1,39,3],[39,10,39,11],[40,1,40,3],[41,1,41,3],[41,5,41,6],[41,10,41,11],[42,1,43,6],[42,10,42,11],[43,10,43,11],[44,10,44,11],[45,1,45,7],[45,10,45,11],[46,10,46,11],[47,10,47,11],[48,10,48,11],[49,1,49,14],[50,1,50,3]]}
[{"$nulls":15},"HIDE","HIDE"]
[]
[]
[]
[]
[]
[null,"Input content in the cells that are this color.",{"$nulls":14},{"$f":"O10-66","v":"2024-09-10"}]
[null,"Sugar Beet Production Reporting Worksheet",{"$nulls":14},{"$f":"O10-46","v":"2024-09-30"}]
{"$rows_left_out":48}
{"sheet":"8","index":7,"n_rows":55,"n_cols":18,"rows_kept":55,"merged":[[0,12,0,14],[6,1,6,14],[7,1,7,14],[8,2,8,4],[8,6,8,7],[9,2,9,4],[9,5,9,6],[9,12,9,13],[10,2,10,4],[10,5,10,6],[11,1,11,7],[11,10,11,14],[12,1,12,7],[12,10,12,14],[13,10,13,11],[14,10,14,11],[15,10,15,11],[16,10,16,11],[17,10,17,11],[18,10,18,11],[19,10,19,11],[20,10,20,11],[21,10,21,11],[22,10,22,11],[23,10,23,11],[24,10,24,11],[25,10,25,11],[26,10,26,11],[27,10,27,11],[28,10,28,11],[29,10,29,11],[30,10,30,11],[31,10,31,11],[32,10,32,11],[33,10,33,11],[35,10,35,11],[36,1,36,3],[36,10,36,11],[37,1,37,3],[37,10,37,11],[38,1,38,3],[38,10,38,11],[39,1,39,3],[39,10,39,11],[40,1,40,3],[41,1,41,3],[41,5,41,6],[41,10,41,11],[42,1,43,6],[42,10,42,11],[43,10,43,11],[44,10,44,11],[45,1,45,7],[45,10,45,11],[46,10,46,11],[47,10,47,11],[48,10,48,11],[49,1,49,14],[50,1,50,3]]}
[{"$nulls":15},"HIDE","HIDE"]
[]
[]
[]
[]
[]
[null,"Input content in the cells that are this color.",{"$nulls":14},{"$f":"O10-66","v":"2024-09-10"}]
[null,"Sugar Beet Production Reporting Worksheet",{"$nulls":14},{"$f":"O10-46","v":"2024-09-30"}]
{"$rows_left_out":48}
{"sheet":"9","index":8,"n_rows":55,"n_cols":18,"rows_kept":55,"merged":[[0,12,0,14],[6,1,6,14],[7,1,7,14],[8,2,8,4],[8,6,8,7],[9,2,9,4],[9,5,9,6],[9,12,9,13],[10,2,10,4],[10,5,10,6],[11,1,11,7],[11,10,11,14],[12,1,12,7],[12,10,12,14],[13,10,13,11],[14,10,14,11],[15,10,15,11],[16,10,16,11],[17,10,17,11],[18,10,18,11],[19,10,19,11],[20,10,20,11],[21,10,21,11],[22,10,22,11],[23,10,23,11],[24,10,24,11],[25,10,25,11],[26,10,26,11],[27,10,27,11],[28,10,28,11],[29,10,29,11],[30,10,30,11],[31,10,31,11],[32,10,32,11],[33,10,33,11],[35,10,35,11],[36,1,36,3],[36,10,36,11],[37,1,37,3],[37,10,37,11],[38,1,38,3],[38,10,38,11],[39,1,39,3],[39,10,39,11],[40,1,40,3],[41,1,41,3],[41,5,41,6],[41,10,41,11],[42,1,43,6],[42,10,42,11],[43,10,43,11],[44,10,44,11],[45,1,45,7],[45,10,45,11],[46,10,46,11],[47,10,47,11],[48,10,48,11],[49,1,49,14],[50,1,50,3]]}
[{"$nulls":15},"HIDE","HIDE"]
[]
[]
[]
[]
[]
[null,"Input content in the cells that are this color.",{"$nulls":14},{"$f":"O10-66","v":"2024-09-10"}]
[null,"Sugar Beet Production Reporting Worksheet",{"$nulls":14},{"$f":"O10-46","v":"2024-09-30"}]
{"$rows_left_out":48}
{"sheet":"10","index":9,"n_rows":55,"n_cols":18,"rows_kept":55,"merged":[[0,12,0,14],[6,1,6,14],[7,1,7,14],[8,2,8,4],[8,6,8,7],[9,2,9,4],[9,5,9,6],[9,12,9,13],[10,2,10,4],[10,5,10,6],[11,1,11,7],[11,10,11,14],[12,1,12,7],[12,10,12,14],[13,10,13,11],[14,10,14,11],[15,10,15,11],[16,10,16,11],[17,10,17,11],[18,10,18,11],[19,10,19,11],[20,10,20,11],[21,10,21,11],[22,10,22,11],[23,10,23,11],[24,10,24,11],[25,10,25,11],[26,10,26,11],[27,10,27,11],[28,10,28,11],[29,10,29,11],[30,10,30,11],[31,10,31,11],[32,10,32,11],[33,10,33,11],[35,10,35,11],[36,1,36,3],[36,10,36,11],[37,1,37,3],[37,10,37,11],[38,1,38,3],[38,10,38,11],[39,1,39,3],[39,10,39,11],[40,1,40,3],[41,1,41,3],[41,5,41,6],[41,10,41,11],[42,1,43,6],[42,10,42,11],[43,10,43,11],[44,10,44,11],[45,1,45,7],[45,10,45,11],[46,10,46,11],[47,10,47,11],[48,10,48,11],[49,1,49,14],[50,1,50,3]]}
[{"$nulls":15},"HIDE","HIDE"]
[]
[]
[]
[]
[]
[null,"Input content in the cells that are this color.",{"$nulls":14},{"$f":"O10-66","v":"2024-09-10"}]
[null,"Sugar Beet Production Reporting Worksheet",{"$nulls":14},{"$f":"O10-46","v":"2024-09-30"}]
{"$rows_left_out":48}
{"sheet":"11","index":10,"n_rows":55,"n_cols":18,"rows_kept":55,"merged":[[0,12,0,14],[6,1,6,14],[7,1,7,14],[8,2,8,4],[8,6,8,7],[9,2,9,4],[9,5,9,6],[9,12,9,13],[10,2,10,4],[10,5,10,6],[11,1,11,7],[11,10,11,14],[12,1,12,7],[12,10,12,14],[13,10,13,11],[14,10,14,11],[15,10,15,11],[16,10,16,11],[17,10,17,11],[18,10,18,11],[19,10,19,11],[20,10,20,11],[21,10,21,11],[22,10,22,11],[23,10,23,11],[24,10,24,11],[25,10,25,11],[26,10,26,11],[27,10,27,11],[28,10,28,11],[29,10,29,11],[30,10,30,11],[31,10,31,11],[32,10,32,11],[33,10,33,11],[35,10,35,11],[36,1,36,3],[36,10,36,11],[37,1,37,3],[37,10,37,11],[38,1,38,3],[38,10,38,11],[39,1,39,3],[39,10,39,11],[40,1,40,3],[41,1,41,3],[41,5,41,6],[41,10,41,11],[42,1,43,6],[42,10,42,11],[43,10,43,11],[44,10,44,11],[45,1,45,7],[45,10,45,11],[46,10,46,11],[47,10,47,11],[48,10,48,11],[49,1,49,14],[50,1,50,3]]}
[{"$nulls":15},"HIDE","HIDE"]
[]
[]
[]
[]
[]
[null,"Input content in the cells that are this color.",{"$nulls":14},{"$f":"O10-66","v":"2024-09-10"}]
[null,"Sugar Beet Production Reporting Worksheet",{"$nulls":14},{"$f":"O10-46","v":"2024-09-30"}]
{"$rows_left_out":48}
{"sheet":"12","index":11,"n_rows":55,"n_cols":18,"rows_kept":55,"merged":[[0,12,0,14],[6,1,6,14],[7,1,7,14],[8,2,8,4],[8,6,8,7],[9,2,9,4],[9,5,9,6],[9,12,9,13],[10,2,10,4],[10,5,10,6],[11,1,11,7],[11,10,11,14],[12,1,12,7],[12,10,12,14],[13,10,13,11],[14,10,14,11],[15,10,15,11],[16,10,16,11],[17,10,17,11],[18,10,18,11],[19,10,19,11],[20,10,20,11],[21,10,21,11],[22,10,22,11],[23,10,23,11],[24,10,24,11],[25,10,25,11],[26,10,26,11],[27,10,27,11],[28,10,28,11],[29,10,29,11],[30,10,30,11],[31,10,31,11],[32,10,32,11],[33,10,33,11],[35,10,35,11],[36,1,36,3],[36,10,36,11],[37,1,37,3],[37,10,37,11],[38,1,38,3],[38,10,38,11],[39,1,39,3],[39,10,39,11],[40,1,40,3],[41,1,41,3],[41,5,41,6],[41,10,41,11],[42,1,43,6],[42,10,42,11],[43,10,43,11],[44,10,44,11],[45,1,45,7],[45,10,45,11],[46,10,46,11],[47,10,47,11],[48,10,48,11],[49,1,49,14],[50,1,50,3]]}
[{"$nulls":15},"HIDE","HIDE"]
[]
[]
[]
[]
[]
[null,"Input content in the cells that are this color.",{"$nulls":14},{"$f":"O10-66","v":"2024-09-10"}]
[null,"Sugar Beet Production Reporting Worksheet",{"$nulls":14},{"$f":"O10-46","v":"2024-09-30"}]
{"$rows_left_out":48}
{"sheet":"13","index":12,"n_rows":55,"n_cols":18,"rows_kept":55,"merged":[[0,12,0,14],[6,1,6,14],[7,1,7,14],[8,2,8,4],[8,6,8,7],[9,2,9,4],[9,5,9,6],[9,12,9,13],[10,2,10,4],[10,5,10,6],[11,1,11,7],[11,10,11,14],[12,1,12,7],[12,10,12,14],[13,10,13,11],[14,10,14,11],[15,10,15,11],[16,10,16,11],[17,10,17,11],[18,10,18,11],[19,10,19,11],[20,10,20,11],[21,10,21,11],[22,10,22,11],[23,10,23,11],[24,10,24,11],[25,10,25,11],[26,10,26,11],[27,10,27,11],[28,10,28,11],[29,10,29,11],[30,10,30,11],[31,10,31,11],[32,10,32,11],[33,10,33,11],[35,10,35,11],[36,1,36,3],[36,10,36,11],[37,1,37,3],[37,10,37,11],[38,1,38,3],[38,10,38,11],[39,1,39,3],[39,10,39,11],[40,1,40,3],[41,1,41,3],[41,5,41,6],[41,10,41,11],[42,1,43,6],[42,10,42,11],[43,10,43,11],[44,10,44,11],[45,1,45,7],[45,10,45,11],[46,10,46,11],[47,10,47,11],[48,10,48,11],[49,1,49,14],[50,1,50,3]]}
[{"$nulls":15},"HIDE","HIDE"]
[]
[]
[]
[]
[]
[null,"Input content in the cells that are this color.",{"$nulls":14},{"$f":"O10-66","v":"2024-09-10"}]
[null,"Sugar Beet Production Reporting Worksheet",{"$nulls":14},{"$f":"O10-46","v":"2024-09-30"}]
{"$rows_left_out":48}
{"sheet":"14","index":13,"n_rows":55,"n_cols":18,"rows_kept":55,"merged":[[0,12,0,14],[6,1,6,14],[7,1,7,14],[8,2,8,4],[8,6,8,7],[9,2,9,4],[9,5,9,6],[9,12,9,13],[10,2,10,4],[10,5,10,6],[11,1,11,7],[11,10,11,14],[12,1,12,7],[12,10,12,14],[13,10,13,11],[14,10,14,11],[15,10,15,11],[16,10,16,11],[17,10,17,11],[18,10,18,11],[19,10,19,11],[20,10,20,11],[21,10,21,11],[22,10,22,11],[23,10,23,11],[24,10,24,11],[25,10,25,11],[26,10,26,11],[27,10,27,11],[28,10,28,11],[29,10,29,11],[30,10,30,11],[31,10,31,11],[32,10,32,11],[33,10,33,11],[35,10,35,11],[36,1,36,3],[36,10,36,11],[37,1,37,3],[37,10,37,11],[38,1,38,3],[38,10,38,11],[39,1,39,3],[39,10,39,11],[40,1,40,3],[41,1,41,3],[41,5,41,6],[41,10,41,11],[42,1,43,6],[42,10,42,11],[43,10,43,11],[44,10,44,11],[45,1,45,7],[45,10,45,11],[46,10,46,11],[47,10,47,11],[48,10,48,11],[49,1,49,14],[50,1,50,3]]}
[{"$nulls":15},"HIDE","HIDE"]
[]
[]
[]
[]
[]
[null,"Input content in the cells that are this color.",{"$nulls":14},{"$f":"O10-66","v":"2024-09-10"}]
[null,"Sugar Beet Production Reporting Worksheet",{"$nulls":14},{"$f":"O10-46","v":"2024-09-30"}]
{"$rows_left_out":48}
{"sheet":"15","index":14,"n_rows":55,"n_cols":18,"rows_kept":55,"merged":[[0,12,0,14],[6,1,6,14],[7,1,7,14],[8,2,8,4],[8,6,8,7],[9,2,9,4],[9,5,9,6],[9,12,9,13],[10,2,10,4],[10,5,10,6],[11,1,11,7],[11,10,11,14],[12,1,12,7],[12,10,12,14],[13,10,13,11],[14,10,14,11],[15,10,15,11],[16,10,16,11],[17,10,17,11],[18,10,18,11],[19,10,19,11],[20,10,20,11],[21,10,21,11],[22,10,22,11],[23,10,23,11],[24,10,24,11],[25,10,25,11],[26,10,26,11],[27,10,27,11],[28,10,28,11],[29,10,29,11],[30,10,30,11],[31,10,31,11],[32,10,32,11],[33,10,33,11],[35,10,35,11],[36,1,36,3],[36,10,36,11],[37,1,37,3],[37,10,37,11],[38,1,38,3],[38,10,38,11],[39,1,39,3],[39,10,39,11],[40,1,40,3],[41,1,41,3],[41,5,41,6],[41,10,41,11],[42,1,43,6],[42,10,42,11],[43,10,43,11],[44,10,44,11],[45,1,45,7],[45,10,45,11],[46,10,46,11],[47,10,47,11],[48,10,48,11],[49,1,49,14],[50,1,50,3]]}
[{"$nulls":15},"HIDE","HIDE"]
[]
[]
[]
[]
[]
[null,"Input content in the cells that are this color.",{"$nulls":14},{"$f":"O10-66","v":"2024-09-10"}]
[null,"Sugar Beet Production Reporting Worksheet",{"$nulls":14},{"$f":"O10-46","v":"2024-09-30"}]
{"$rows_left_out":48}
{"sheet":"16","index":15,"n_rows":55,"n_cols":18,"rows_kept":55,"merged":[[0,12,0,14],[6,1,6,14],[7,1,7,14],[8,2,8,4],[8,6,8,7],[9,2,9,4],[9,5,9,6],[9,12,9,13],[10,2,10,4],[10,5,10,6],[11,1,11,7],[11,10,11,14],[12,1,12,7],[12,10,12,14],[13,10,13,11],[14,10,14,11],[15,10,15,11],[16,10,16,11],[17,10,17,11],[18,10,18,11],[19,10,19,11],[20,10,20,11],[21,10,21,11],[22,10,22,11],[23,10,23,11],[24,10,24,11],[25,10,25,11],[26,10,26,11],[27,10,27,11],[28,10,28,11],[29,10,29,11],[30,10,30,11],[31,10,31,11],[32,10,32,11],[33,10,33,11],[35,10,35,11],[36,1,36,3],[36,10,36,11],[37,1,37,3],[37,10,37,11],[38,1,38,3],[38,10,38,11],[39,1,39,3],[39,10,39,11],[40,1,40,3],[41,1,41,3],[41,5,41,6],[41,10,41,11],[42,1,43,6],[42,10,42,11],[43,10,43,11],[44,10,44,11],[45,1,45,7],[45,10,45,11],[46,10,46,11],[47,10,47,11],[48,10,48,11],[49,1,49,14],[50,1,50,3]]}
[{"$nulls":15},"HIDE","HIDE"]
[]
[]
[]
[]
[]
[null,"Input content in the cells that are this color.",{"$nulls":14},{"$f":"O10-66","v":"2024-09-10"}]
[null,"Sugar Beet Production Reporting Worksheet",{"$nulls":14},{"$f":"O10-46","v":"2024-09-30"}]
{"$rows_left_out":48}
{"sheet":"17","index":16,"n_rows":55,"n_cols":18,"rows_kept":55,"merged":[[0,12,0,14],[6,1,6,14],[7,1,7,14],[8,2,8,4],[8,6,8,7],[9,2,9,4],[9,5,9,6],[9,12,9,13],[10,2,10,4],[10,5,10,6],[11,1,11,7],[11,10,11,14],[12,1,12,7],[12,10,12,14],[13,10,13,11],[14,10,14,11],[15,10,15,11],[16,10,16,11],[17,10,17,11],[18,10,18,11],[19,10,19,11],[20,10,20,11],[21,10,21,11],[22,10,22,11],[23,10,23,11],[24,10,24,11],[25,10,25,11],[26,10,26,11],[27,10,27,11],[28,10,28,11],[29,10,29,11],[30,10,30,11],[31,10,31,11],[32,10,32,11],[33,10,33,11],[35,10,35,11],[36,1,36,3],[36,10,36,11],[37,1,37,3],[37,10,37,11],[38,1,38,3],[38,10,38,11],[39,1,39,3],[39,10,39,11],[40,1,40,3],[41,1,41,3],[41,5,41,6],[41,10,41,11],[42,1,43,6],[42,10,42,11],[43,10,43,11],[44,10,44,11],[45,1,45,7],[45,10,45,11],[46,10,46,11],[47,10,47,11],[48,10,48,11],[49,1,49,14],[50,1,50,3]]}
[{"$nulls":15},"HIDE","HIDE"]
[]
[]
[]
[]
[]
[null,"Input content in the cells that are this color.",{"$nulls":14},{"$f":"O10-66","v":"2024-09-10"}]
[null,"Sugar Beet Production Reporting Worksheet",{"$nulls":14},{"$f":"O10-46","v":"2024-09-30"}]
{"$rows_left_out":48}
{"sheet":"18","index":17,"n_rows":55,"n_cols":18,"rows_kept":55,"merged":[[0,12,0,14],[6,1,6,14],[7,1,7,14],[8,2,8,4],[8,6,8,7],[9,2,9,4],[9,5,9,6],[9,12,9,13],[10,2,10,4],[10,5,10,6],[11,1,11,7],[11,10,11,14],[12,1,12,7],[12,10,12,14],[13,10,13,11],[14,10,14,11],[15,10,15,11],[16,10,16,11],[17,10,17,11],[18,10,18,11],[19,10,19,11],[20,10,20,11],[21,10,21,11],[22,10,22,11],[23,10,23,11],[24,10,24,11],[25,10,25,11],[26,10,26,11],[27,10,27,11],[28,10,28,11],[29,10,29,11],[30,10,30,11],[31,10,31,11],[32,10,32,11],[33,10,33,11],[35,10,35,11],[36,1,36,3],[36,10,36,11],[37,1,37,3],[37,10,37,11],[38,1,38,3],[38,10,38,11],[39,1,39,3],[39,10,39,11],[40,1,40,3],[41,1,41,3],[41,5,41,6],[41,10,41,11],[42,1,43,6],[42,10,42,11],[43,10,43,11],[44,10,44,11],[45,1,45,7],[45,10,45,11],[46,10,46,11],[47,10,47,11],[48,10,48,11],[49,1,49,14],[50,1,50,3]]}
[{"$nulls":15},"HIDE","HIDE"]
[]
[]
[]
[]
[]
[null,"Input content in the cells that are this color.",{"$nulls":14},{"$f":"O10-66","v":"2024-09-10"}]
[null,"Sugar Beet Production Reporting Worksheet",{"$nulls":14},{"$f":"O10-46","v":"2024-09-30"}]
{"$rows_left_out":48}
{"sheet":"19","index":18,"n_rows":55,"n_cols":18,"rows_kept":55,"merged":[[0,12,0,14],[6,1,6,14],[7,1,7,14],[8,2,8,4],[8,6,8,7],[9,2,9,4],[9,5,9,6],[9,12,9,13],[10,2,10,4],[10,5,10,6],[11,1,11,7],[11,10,11,14],[12,1,12,7],[12,10,12,14],[13,10,13,11],[14,10,14,11],[15,10,15,11],[16,10,16,11],[17,10,17,11],[18,10,18,11],[19,10,19,11],[20,10,20,11],[21,10,21,11],[22,10,22,11],[23,10,23,11],[24,10,24,11],[25,10,25,11],[26,10,26,11],[27,10,27,11],[28,10,28,11],[29,10,29,11],[30,10,30,11],[31,10,31,11],[32,10,32,11],[33,10,33,11],[35,10,35,11],[36,1,36,3],[36,10,36,11],[37,1,37,3],[37,10,37,11],[38,1,38,3],[38,10,38,11],[39,1,39,3],[39,10,39,11],[40,1,40,3],[41,1,41,3],[41,5,41,6],[41,10,41,11],[42,1,43,6],[42,10,42,11],[43,10,43,11],[44,10,44,11],[45,1,45,7],[45,10,45,11],[46,10,46,11],[47,10,47,11],[48,10,48,11],[49,1,49,14],[50,1,50,3]]}
[{"$nulls":15},"HIDE","HIDE"]
[]
[]
[]
[]
[]
[null,"Input content in the cells that are this color.",{"$nulls":14},{"$f":"O10-66","v":"2024-09-10"}]
[null,"Sugar Beet Production Reporting Worksheet",{"$nulls":14},{"$f":"O10-46","v":"2024-09-30"}]
{"$rows_left_out":48}
{"sheet":"20","index":19,"n_rows":55,"n_cols":18,"rows_kept":55,"merged":[[0,12,0,14],[6,1,6,14],[7,1,7,14],[8,2,8,4],[8,6,8,7],[9,2,9,4],[9,5,9,6],[9,12,9,13],[10,2,10,4],[10,5,10,6],[11,1,11,7],[11,10,11,14],[12,1,12,7],[12,10,12,14],[13,10,13,11],[14,10,14,11],[15,10,15,11],[16,10,16,11],[17,10,17,11],[18,10,18,11],[19,10,19,11],[20,10,20,11],[21,10,21,11],[22,10,22,11],[23,10,23,11],[24,10,24,11],[25,10,25,11],[26,10,26,11],[27,10,27,11],[28,10,28,11],[29,10,29,11],[30,10,30,11],[31,10,31,11],[32,10,32,11],[33,10,33,11],[35,10,35,11],[36,1,36,3],[36,10,36,11],[37,1,37,3],[37,10,37,11],[38,1,38,3],[38,10,38,11],[39,1,39,3],[39,10,39,11],[40,1,40,3],[41,1,41,3],[41,5,41,6],[41,10,41,11],[42,1,43,6],[42,10,42,11],[43,10,43,11],[44,10,44,11],[45,1,45,7],[45,10,45,11],[46,10,46,11],[47,10,47,11],[48,10,48,11],[49,1,49,14],[50,1,50,3]]}
[{"$nulls":15},"HIDE","HIDE"]
[]
[]
[]
[]
[]
[null,"Input content in the cells that are this color.",{"$nulls":14},{"$f":"O10-66","v":"2024-09-10"}]
[null,"Sugar Beet Production Reporting Worksheet",{"$nulls":14},{"$f":"O10-46","v":"2024-09-30"}]
{"$rows_left_out":48}
{"sheet":"Master Yield","index":20,"n_rows":29,"n_cols":5,"rows_kept":29,"merged":[[0,3,2,4],[28,0,28,4]]}
[{"$nulls":3},"Master Yield Summary"]
[]
[]
[]
[]
["Worksheet","Legal Description","Acres","EH Adjusted Production","Unadjusted Production"]
[1,{"$f":"IF('1'!$H$11=\"\",\"\",'1'!$H$11)","v":""},{"$f":"'1'!L10","v":{"v":0,"d":"0.00"}},{"$f":"'1'!M46","v":0},{"$f":"'1'!N46","v":0}]
[2,{"$f":"IF('2'!$H$11=\"\",\"\",'2'!$H$11)","v":""},{"$f":"'2'!L10","v":{"v":0,"d":"0.00"}},{"$f":"'2'!M46","v":0},{"$f":"'2'!N46","v":0}]
{"$rows_left_out":22}
{"sheet":"Draft changes for 2021","index":21,"n_rows":8,"n_cols":6,"rows_kept":8,"hidden":true,"merged":[[0,0,0,2],[1,0,1,2],[2,0,2,2],[3,0,3,2],[4,0,4,2],[7,0,8,10]]}
["Unit Early Harvest Summary",null,null,"EH Prod","EH Acres","EH Yield"]
["Early Harvested Production and Yield/Acre: ",null,null,{"v":53040,"d":"53,040"},25.11,{"v":2112.31,"d":"2112"}]
["Adjusted Early Harvested Production and Yield/Acre: ",null,null,{"v":61308,"d":"61,308"},25.11,2442]
[" Approved Yield Cap: ",null,null,{"v":55543.32,"d":"55,543"},25.11,2212]
["Non EH Actual Yield Cap:",null,null,{"v":56272,"d":"56,272"},25.11,2241]
["* Production Allowed for Early Harvested acres: ",null,null,{"v":56272,"d":"56,272"},"To Unit Harvest Summary "]
[]
["* Uses actual EH Production if yield is > Approved yield and > Non EH Actual yield.     If not, uses lesser of Adjusted EH  Production not to exceed higher of or Approved yield Production or Non EH Actual yield Production.  "]
{"$rows_left_out":1}
{"sheet":"Data Validations","index":22,"n_rows":49,"n_cols":8,"rows_kept":49,"hidden":true}
["mi","2019-10-15",{"$nulls":5},"11/21/23 - Questions for Grant"]
[{"$nulls":7},"Are the End of Insurance Periods still accurate for 2023 and 2024? Yes"]
[{"$f":"'1'!O10","v":"2024-11-15"},{"$nulls":6},"Do we still need to show 2020, 2021 or 2022?"]
[{"$nulls":7},"Do we account for Michigan within this spreadsheet?"]
{"$rows_empty":9}
[null,"Years",null,"Year","End of Insurance Period:  "]
[null,2019,null,2018,"2018-11-15",45]
[null,2020,null,2018,"2018-12-05",45]
{"$rows_left_out":33}